Home > Labview Error > Labview Error 1172 .net

Labview Error 1172 .net

What is the inner cover of the winter shoes called in English? Klicke ich zweimal auf "weiter" kommt eine weitere Fehlermeldung. That function worked fine and didn't throw any errors.    I am completely stumped as to why this is happening. Brian Tylerhttp://detritus.blogs.com/lycangeek 0 Kudos Message 6 of 10 (12,760 Views) Reply 0 Kudos Re: Why am I getting Error 1172 when trying to invoke .NET assembly? Source

Jump to content Calling External Code Existing user? Auch versuchen einige dieser Sites durch Lecke im Browser versteckte Dinge auf Deinen Computer zu laden. Ja das sehe ich beim Laden, wenn er sich alles notwendige zusammensucht. How to describe very damaging natural weapon attacks from a weak creature What can I do about a rock climbing ban? http://digital.ni.com/public.nsf/allkb/B15CE9F2715434C386256D3500601878

It's easy! Richard2950 Member ‎10-14-2004 09:53 PM Options Mark as New Bookmark Subscribe Subscribe to RSS Feed Highlight Print Email to a Friend Report to a Moderator Thank you, Philip. I appreciate any help I can get! System.ArgumentNullException: Key cannot be null. 00000015 114.37963104 [3404] Parameter name: key 00000016 114.37963104 [3404] at System.Collections.Hashtable.get_Item(Object key) 00000017 114.37963104 [3404] at NationalInstruments.LabVIEW.SyncInvokeTable.LookupControl(Object key) 00000018 114.37963104 [3404] at NationalInstruments.LabVIEW.DNRuntime.InvokeMethod(Int32 invokeType, Type type,

You could try removing the control and it's container from the Front panel and add it back in again. kernel32, user32, gdi32, und Friends sind so mit anderen im System vorhandenen DLLs gekoppelt, dass das Auswechseln von einer davon sehr leicht zu hässlichen Problemen führen kann. Wenn es dann funktioniert werden die dlls nicht richtig erkannt und du kannst dir entweder einen C#Wrapper schreiben, der dir die Assemblies dynamisch in deine AppDomain lädt (so wie zB hier Unfortunately this is a bit hypothetical unless you can provide some more information (LabVIEW version, code, setup, anything) and some more ideas as to how you have your system configured. 0

I created the assembly using the LabVIEW .NET browser that I downloaded from NI. Register a new account Sign in Already have an account? Share this post Link to post Share on other sites PJM_labview 32 The 500 club Members 32 777 posts Version:LabVIEW 2009 Since:1998 Posted May 28, 2011 Not exactly what you see it here I tried doing some web searching on the error message, and it's all about playing around with the various security settings and demands - running code on a network share is

Ich hoffe ihr könnt mir da auf die Sprünge helfen! Unless you're trying to access static methods or properties, you have to instantiate the object with the constructor node before any object exists that has any methods or properties. I would still encourage the original poster to contact their NI representative in the hope that this improves the usbaility of this feature over time. Or sign in with one of these services Sign in with Facebook Sign in with Twitter Sign in with LinkedIn Sign Up All Content All Content This Topic This Forum Advanced

Jetzt habe ich von der Firma AUTOLAB ein Software-Development-Kit runtergeladen um ein Messgerät mit LabVIEW ansteuern und auslesen zu können. labjunky. .net labview share|improve this question asked Feb 13 '12 at 2:47 labjunky 4351618 Is there anyway to attach my code? –labjunky Feb 13 '12 at 2:47 Shared assemblies must be installed in the GAC. Das brauchst du nur, wenn du Assemblies von einem Server laden willst msdn.com - Running Intranet Applications in Full Trust (05.07.2012 10:16 )Woodie schrieb: Achso, .Net Framework 4.0 habe ich auch

The attached Word doc mentions a driver from "FT". this contact form All rights reserved. Presumably the author of the assembly has a test harness of some description. I will forward your questions/comments to the engineers in China.

Findet LabVIEW vielleicht etwas nicht? I am completely stumped as to why this is happening. This Microsoft KB discusses the differences and how to install a shared assembly: http://support.microsoft.com/default.aspx?scid=kb;en-us;315682 You can also see the following post which discusses this issue as well: http://forums.ni.com/ni/board/message?board.id=170&message.id=90149&requireLogin=False I hope this have a peek here That test passed at the development site in Mexico.

What type of architecture would an arachnid /crustacean likely to have? We sent the DLL from Mexico to the engineers in China, and every time LabView calls the DLL, we get error 1172. Suche Forenstartseite LVF - NEWS -- LabVIEW Forum News ---- NewsArchiv ---- Systemarbeiten -- NI-News ---- NI-Archive ---- NI-WebCasts -- Forum Feedback & Support ---- Lob & Kritik ---- Tutorials ------

But just out of curiosity, what did you mean by access "static" methods or properties?

How to distinguish between American Indians and Indian Indians in native English (language) parlance? Dann irgendwann konnte ich ein Beispielprogramm starten und die Kommunikation mit dem Messgerät stand auch, Werte kommen und gehen. LabVIEW fügt hier noch das Verzeichnis des Projekts hinzu, aber nicht des aktuellen VIs. Now this seems to work with no error.

By default, when a.NET program is compiled, the assembly produced will be a private assembly. How do I use mathmode in tables to write physics formulae? Muss ich LabVIEW irgendwie sagen, dass es das .NET 4.0 voll unterstützen soll? Check This Out Bevor das Ganze aber lief, musste unsere LabVIEW Version von 7.1 auf 2011 gebracht werden (was mich schon graue Haare gekostet hat ).

Wenn er beim Laden alles gefunden hat, dann dürfte er doch später beim Ausführen eigentlich keine Probleme mit den Bezügen haben oder? Other considerations for calling a .NET Assembly from LabVIEW are: Private assemblies must be placed in the same directory as the calling application. I'll forward your comments to both teams (in Mexico and China) and if they have any questions or comments in response, I will post them here. Coal_Man Member ‎08-13-2007 10:57 AM Options Mark as New Bookmark Subscribe Subscribe to RSS Feed Highlight Print Email to a Friend Report to a Moderator Matt, Is the assembly that you

Share this post Link to post Share on other sites rolfk 369 LabVIEW Aficionado Members 369 2,613 posts Location:Netherlands Version:LabVIEW 2011 Since:1992 Posted May 27, 2011 Well, it's obviously the But just out of curiosity, what did you mean by access "static" methods or properties? Unless you're trying to access static methods or properties, you have to instantiate the object with the constructor node before any object exists that has any methods or properties.Mark ok sounds I ended up solving the problem!

Our production schedule is getting hit hard until we can solve this problem. Brian CoalsonSoftware EngineerNational Instruments 0 Kudos Message 10 of 10 (12,707 Views) Reply 0 Kudos All Forum Topics Previous Topic Next Topic Privacy | Terms of Use | Other Legal Info I'll forward your comments to both teams (in Mexico and China) and if they have any questions or comments in response, I will post them here. Register a new account Sign in Already have an account?

Chuck Reid 05.07.2012, 13:40 Beitrag #3 Woodie LVF-Neueinsteiger Beiträge: 8 Registriert seit: Jul 2012 2011 2012 DE RE: .NET Error 1172 Danke für deine Mithilfe! std::string += operator cannot pass 0 as argument What "actually" happens at T-minus-0 Why were people led to believe that the Apollo mission was fake in Interstellar? I also followed this procedure but LabVIEW returns the same error.   Thanks     Share this post Link to post Share on other sites Yair 218 Extwemely Active Members Inner Exception: System.Runtime.Serialization.SerializationException: Die Assembly "EcoChemie.Shared70, Version=7.0.3727.18958, Culture=neutral, PublicKeyToken=null" kann nicht gefunden werden.) System.Runtime.Serialization.SerializationException in Load Procedure.vi->[TN#5] Measuring Complete Example(A).vi Da steht, dass er die Assembly "Eco...." nicht finden kann, die